{"text_format":"1","workbook":"xlsx","n_sheets":9,"sheets":["Instrucciones","Coordenadas","Combustibles","Regiones","Tarifas","Listas","Datos y cálculos","Precios_","Notas"],"not_rendered":{"charts":1,"images":5,"macros":1,"external_links":0,"defined_names":45,"comments":0,"pivot_tables":0},"unopened":[],"bounds":{"document_bytes":16777216,"sheet_cells":100000,"rows_first":2000,"rows_last":500,"rows_between":2000,"halvings":0,"cell_chars":16384,"cell_head_chars":4096},"cells_cut":0,"cells_raw":0,"read":"whole","date_system":"1900"}

{"sheet":"Instrucciones","index":0,"n_rows":24,"n_cols":1,"rows_kept":24,"cut":false,"hidden":false,"merged":[[23,0,23,12],[5,0,5,5],[6,0,6,5],[7,0,7,5],[8,0,8,5],[9,0,9,5],[21,0,21,12],[22,0,22,12],[4,0,4,12],[17,0,17,12],[18,0,18,12],[19,0,19,12],[20,0,20,12],[11,0,11,12],[12,0,12,12],[13,0,13,12],[14,0,14,12],[15,0,15,12],[16,0,16,12]]}
["Centro Nacional de Control del Gas Natural"]
["Unidad de Gestión Técnica y Planeación"]
["Dirección Ejecutiva de Planeación"]
[]
["CALCULADORA DE COORDENADAS GEOGRÁFICAS A DECIMALES"]
["Instrucciones: "]
["Introduzca las coordenadas en grados, minutos y segundos que desea convertir."]
["El primer renglón de la calculadora corresponde a la latitud o coordenadas Y."]
["El segundo renglón de la calculadora corresponde a la longitud o coordenadas X."]
["En la columna de Grados Decimales obtendrá la conversión a coordenadas decimales."]
[]
["CALCULADORA DE PRECIOS DE COMBUSTIBLES SUSTITUTOS"]
["Instrucciones:"]
["La calculadora de precios se compone de 3 secciones:"]
["1- La primera sección contiene campos, en color blanco, que permiten introducir los valores a convertir."]
["2- La segunda sección muestra en los campos en color gris los cálculos realizados."]
["3- La tercera sección grafica la comparación de costos entre el gas natural y el combustible seleccionado. Además se presenta la entidad seleccionada indicando la región a la que pertenece el punto de extracción."]
["El campo \"Fecha\" despliega una lista de fechas para seleccionar."]
["El campo \"Combustible\" despliega una lista con el combustible a elegir. Los disponibles son: Combustóleo, Diésel, Gas LP por kilogramo, Gas LP por litro, Gasolina Premium y Gasolina Magna."]
["En el campo \"Consumo de combustible\" se introduce la cantidad de combustible a transformar."]
{"$rows_left_out":5}
{"sheet":"Coordenadas","index":1,"n_rows":16,"n_cols":6,"rows_kept":16,"cut":false,"hidden":false,"merged":[[4,0,4,5],[12,1,12,16383],[6,0,6,3]]}
["Centro Nacional de Control del Gas Natural"]
["Unidad de Gestión Técnica y Planeación"]
["Dirección Ejecutiva de Planeación"]
[]
["CALCULADORA DE COORDENADAS GEOGRÁFICAS A DECIMALES"]
[null,null,null,null,"Latitud","Longitud"]
["Favor de introducir las coordenadas en las casillas blancas:",null,null,null,"20°42'58.0","100°19'26.5"]
[null,"Grados","Minutos","Segundos","Orientación","Grados Decimales"]
["Latitud",{"$f":"MID(E7,1,SEARCH(\"°\",E7)-1)","v":"20"},{"$f":"MID(E7,SEARCH(\"°\",E7)+1,SEARCH(\"'\",E7)-SEARCH(\"°\",E7)-1)","v":"42"},{"$f":"MID(E7,SEARCH(\"'\",E7)+1,4)","v":"58.0"},"Norte N",{"$f":"B9+C15+D15","v":20.716111111111111}]
[]
["Longitud",{"$f":"MID(F7,1,SEARCH(\"°\",F7)-1)","v":"100"},{"$f":"MID(F7,SEARCH(\"°\",F7)+1,SEARCH(\"'\",F7)-SEARCH(\"°\",F7)-1)","v":"19"},{"$f":"MID(F7,SEARCH(\"'\",F7)+1,4)","v":"26.5"},"Oeste W",{"$f":"-(B11+C16+D16)","v":-100.32402777777777}]
[]
["Dirección",{"$f":"VBAProject.Módulo3.ReverseGeocode(F9,F11)","v":"PM8G+8V, 76266 Dolores, Qro., México"}]
[]
[null,null,{"$f":"C9/60","v":0.7},{"$f":"D9/3600","v":1.6111111111111111E-2}]
[null,null,{"$f":"C11/60","v":0.31666666666666665},{"$f":"D11/3600","v":7.3611111111111108E-3}]

{"sheet":"Combustibles","index":2,"n_rows":44,"n_cols":4,"rows_kept":44,"cut":false,"hidden":false,"merged":[[4,0,4,12],[5,3,5,12],[5,0,5,2],[25,0,25,2],[43,1,43,2],[7,1,7,2],[9,1,9,2]]}
["Centro Nacional de Control del Gas Natural"]
["Unidad de Gestión Técnica y Planeación"]
["Dirección Ejecutiva de Planeación"]
[]
["CALCULADORA DE PRECIOS DE COMBUSTIBLES SUSTITUTOS"]
["Primer sección",null,null,"Tercera sección"]
[]
["Fecha","2023-03-01"]
[]
["Combustible","Combustoleo"]
[]
["Consumo de combustible",43,{"$f":"VLOOKUP(B10,Precios_!$C$4:$F$509,4,0)","v":"Lt"}]
[]
["Unidad de tiempo","Día"]
[]
["Tipo de cambio",{"$f":"VLOOKUP(B8,Tabla2[],5,FALSE)","v":18.402999999999999},"Pesos por Dólar"]
[null,null,{"$f":"IF(B14=\"Mes\",30,IF(B14=\"Día\",1,IF(B14=\"Semana\",7, IF(B14=\"Quincena\",15,IF(B14=\"Año\",365,0)))))","v":1}]
[null,"Por unidad de Combustible","Equivalente en energía"]
["MMBtu diario",{"$f":"VLOOKUP(B10,'Datos y cálculos'!$A$2:$C$9,3,0)","v":4.2285240000000002E-2},{"$f":"B19*B12/C17","v":1.8182653200000001}]
["GJ diario",{"$f":"VLOOKUP(B10,'Datos y cálculos'!$A$1:$C$9,2,0)","v":4.0078669999999997E-2},{"$f":"B20*B12/C17","v":1.7233828099999999}]
{"$rows_left_out":25}
{"sheet":"Regiones","index":3,"n_rows":40,"n_cols":57,"rows_kept":40,"cut":false,"hidden":true,"merged":[]}
["Entidad","IPGN","PUNTO DE INYECCIÓN",null,"PUNTO DE INYECCIÓN","LATITUD","LONGITUD","PRECIO_REFERENCIA","estado","#ZONA_ZONA_INYEC","Región_inyec",null,null,"#ZONA_ZONA_EXT","estado_extr",null,null,"#ZONA_ZONA_INY","#ZONA_ZONA_EXT",null,"Entidad","IPGN",null,null,null,null,"=INDIRECTO(SUSTITUIR(X4,\" \",\"_\"))"]
["Aguascalientes","Región IV","V024",8,"CACTUS100",17.9162684867898,-93.157654093187503,"IPGN 6","Chiapas","SUR","Región VI",8,"1","NOROESTE","Chihuahua","Región II","1","3. NORESTE","1. NOROESTE",null,"Aguascalientes","Región IV"]
["Baja California","Región I","V025",8,"CACTUSNVOPMX",17.9162684867898,-93.157654093187503,"IPGN 6","Chiapas","SUR","Región VI",8,"1","NOROESTE","Durango","Región II","1","3. NORESTE","2. NORTE CENTRO",null,"Baja California","Región I",null,"Entidad","Inyección","Región"]
["Baja California Sur","NA","V028",3,"CULEBRA",25.833447324042499,-99.020902886656501,"IPGN 3","Nuevo León","NORESTE","Región III",3,"1","NOROESTE","Coahuila","Región II","1","3. NORESTE","3. NORESTE",null,"Baja California Sur","NA",null,"Tabasco","Región VI","Cpg_Pozarica"]
["Campeche","Región VI","V030",1,"GLORIADIOS",31.545652,-106.251284,"Waha","Chihuahua","NOROESTE","Región II",1,"2","NORTE CENTRO","Coahuila","Región II","2","3. NORESTE","4. TRONCAL",null,"Campeche","Región VI"]
["Chiapas","Región VI","V032",3,"IMPCORAL",26.314454999999999,-98.743919000000005,"HSC","Tamaulipas","NORESTE","Región III",3,"2","NORTE CENTRO","Chihuahua","Región II","2","3. NORESTE","5. CENTRO",null,"Chiapas","Región VI"]
["Chihuahua","Región II","V033",3,"IMPTENNESSEE",26.085947000000001,-98.264679999999899,"HSC","Tamaulipas","NORESTE","Región III",3,"2","NORTE CENTRO","Durango","Región II","2","3. NORESTE","6. OCCIDENTE",null,"Chihuahua","Región II"]
["Ciudad de México","Región V","V034",3,"IMPTETCO",26.086008,-98.264707000000001,"HSC","Tamaulipas","NORESTE","Región III",3,"3","NORESTE","Nuevo León","Región III","3","3. NORESTE","7. GOLFO",null,"Ciudad de México","Región V"]
["Coahuila","Región II","V036",3,"INYMONCLOVA",27.0504213645645,-101.372160503053,"IPGN 2","Coahuila","NORESTE","Región II",3,"3","NORESTE","Tamaulipas","Región III","3","4. TRONCAL","3. NORESTE",null,"Coahuila","Región II","Aguascalientes","Baja California","Baja California Sur","Campeche","Chiapas","Chihuahua","Ciudad de México","Coahuila","Colima","Durango","Guanajuato","Guerrero","Hidalgo","Jalisco","Estado de México","Michoacán","Morelos","Nayarit","Nuevo León","Oaxaca","Puebla","Querétaro","Quintana Roo","San Luis Potosí","Sinaloa","Sonora","Tabasco","Tamaulipas","Tlaxcala","Veracruz","Yucatán","Zacatecas",null,"Aguascalientes","Región IV"]
["Colima","Región IV","V037",3,"KMMTYINY",26.507705999999999,-99.112679,"Henry Hub","Tamaulipas","NORESTE","Región III",3,"3","NORESTE","Coahuila","Región II","3","4. TRONCAL","4. TRONCAL",null,"Colima","Región IV","Región IV","Región I","Sin gas","Región VI","Región VI","Región II","Región V","Región II","Región IV","Región II","Región V","Región V","Región V","Región IV","Región V","Región V","Región V","Sin gas","Región III","Región VI","Región V","Región V","Región VI","Región V","Región I","Región I","Región VI","Región III","Región V","Región VI","Región VI","Región IV",null,"Baja California","Región I"]
["Durango","Región II","PEPCOCUITE",7,"PEPCOCUITE",19.146682999999999,-96.184413000000006,"IPGN 6","Veracruz","GOLFO","Región VI",7,"4","TRONCAL","Tamaulipas","Región III","4","4. TRONCAL","5. CENTRO",null,"Durango","Región II",null,null,null,null,null,null,null,null,null,null,null,null,null,null,null,null,null,null,null,null,null,null,null,null,null,null,null,null,null,null,null,null,null,"Baja California Sur","Sin gas"]
["Guanajuato","Región V","V042",7,"PLAYUELA",19.0003718514259,-96.098371555829203,"IPGN 6","Veracruz","GOLFO","Región VI",7,"4","TRONCAL","Veracruz","Región VI","4","4. TRONCAL","6. OCCIDENTE",null,"Guanajuato","Región V",null,null,null,null,null,null,null,null,null,null,null,null,null,null,null,null,null,null,null,null,null,null,null,null,null,null,null,null,null,null,null,null,null,"Campeche","Región VI"]
["Guerrero","Región V","V045",7,"PEPMENDOZA",18.835550926201499,-96.974789351352698,"IPGN 6","Veracruz","GOLFO","Región VI",7,"5","CENTRO","Veracruz","Región VI","5","4. TRONCAL","7. GOLFO",null,"Guerrero","Región V",null,null,null,null,null,null,null,null,null,null,null,null,null,null,null,null,null,null,null,null,null,null,null,null,null,null,null,null,null,null,null,null,null,"Chiapas","Región VI"]
["Hidalgo","Región V","V051",5,"RAUDAL",20.947987999999999,-97.623894000000007,"IPGN 6","Veracruz","CENTRO","Región VI",5,"5","CENTRO","Tlaxcala","Región V","5","1. NOROESTE","1. NOROESTE",null,"Hidalgo","Región V",null,null,null,null,null,null,null,null,null,null,null,null,null,null,null,null,null,null,null,null,null,null,null,null,null,null,null,null,null,null,null,null,null,"Chihuahua","Región II"]
["Jalisco","Región IV","V055",4,"LNGALTINY",22.492016,-97.895809,"GCM","Tamaulipas","TRONCAL","Región III",4,"5","CENTRO","Hidalgo","Región V","5","1. NOROESTE","2. NORTE CENTRO",null,"Jalisco","Región IV","Inyección",null,null,null,null,null,null,null,null,null,null,null,null,null,null,null,null,null,null,null,null,null,null,null,null,null,null,null,null,null,null,null,null,"Ciudad de México","Región V"]
["Estado de México","Región V","V056",4,"CAMPONEJO",23.792394602507599,-98.092547729210693,"IPGN 3","Tamaulipas","TRONCAL","Región III",4,"5","CENTRO","Estado de México","Región V","5","1. NOROESTE","3. NORESTE",null,"Estado de México","Región V","Sin gas","Región I","Región II","Región III","Región IV","Región V","Región VI",null,"Región II","Región III","Región IV","Región V","Región VI",null,null,null,null,null,null,null,null,null,null,null,null,null,null,null,null,null,null,null,null,"Coahuila","Región II"]
["Michoacán","Región V","V059",4,"MAREOGRAFO",25.535381174505801,-98.886916542969303,"IPGN 3","Nuevo León","TRONCAL","Región III",4,"5","CENTRO","Puebla","Región V","5","5. CENTRO","4. TRONCAL",null,"Michoacán","Región V","NA","NA","V030","V028","V918","V062","V024",null,"V030","V028","V918","V062","V024",null,null,null,null,null,null,null,null,null,null,null,null,null,null,null,null,null,null,null,null,"Colima","Región IV"]
["Morelos","Región V","V061",3,"RAMONES",26.314454999999999,-98.743919000000005,"Agua Dulce","Tamaulipas","NORESTE","Región III",3,"5","CENTRO","Guanajuato","Región V","5","5. CENTRO","5. CENTRO",null,"Morelos","Región V",null,null,"V036","V032",null,null,"V025",null,"V036","V032",null,null,"V025",null,null,null,null,null,null,null,null,null,null,null,null,null,null,null,null,null,null,null,null,"Durango","Región II"]
["Nayarit","NA","V062",3,"IMPENERGT",27.898088999999999,-99.893972000000005,"HSC","Coahuila","NORESTE","Región II",3,"5","CENTRO","Querétaro","Región V","5","5. CENTRO","6. OCCIDENTE",null,"Nayarit","NA",null,null,"V067","V033",null,null,"Pepcocuite",null,"V067","V033",null,null,"Pepcocuite",null,null,null,null,null,null,null,null,null,null,null,null,null,null,null,null,null,null,null,null,"Guanajuato","Región V"]
["Nuevo León","Región III","V905",5,"CPG_POZARICA",20.524805606394899,-97.461441944379501,"IPGN 6","Veracruz","CENTRO","Región VI",5,"5","CENTRO","San Luis Potosí","Región V","5","5. CENTRO","7. GOLFO",null,"Nuevo León","Región III",null,null,null,"V034",null,null,"V042",null,null,"V034",null,null,"V042",null,null,null,null,null,null,null,null,null,null,null,null,null,null,null,null,null,null,null,null,"Guerrero","Región V"]
{"$rows_left_out":21}
{"sheet":"Tarifas","index":4,"n_rows":127,"n_cols":6,"rows_kept":127,"cut":false,"hidden":true,"merged":[]}
[null,"Punto de inyección","Punto de extracción",null,"Base","Peso/GJ"]
[{"$f":"MID(B2,6,1)","v":"1"},"Zona 1","Zona 1",{"$f":"MID(B2,6,1)&MID(C2,6,2)","v":"11"},"Firme",3.3682500000000002]
[{"$f":"MID(B3,6,1)","v":"1"},"Zona 1","Zona 2",{"$f":"MID(B3,6,1)&MID(C3,6,2)","v":"12"},"Firme",4.2759299999999998]
["1","Zona 1","Zona 3","13","Firme",8.7890300000000003]
["1","Zona 1","Zona 4","14","Firme",12.326510000000001]
["1","Zona 1","Zona 5","15","Firme",18.936360000000001]
["1","Zona 1","Zona 6","16","Firme",22.344270000000002]
["1","Zona 1","Zona 7","17","Firme","Sin tarifa"]
["1","Zona 1","Zona 8","18","Firme","Sin tarifa"]
["1","Zona 1","Zona 9","19","Firme","Sin tarifa"]
["1","Zona 1","Zona 1","11","Interrumpible",3.3345600000000002]
["1","Zona 1","Zona 2","12","Interrumpible",4.2331700000000003]
["1","Zona 1","Zona 3","13","Interrumpible",8.7011400000000005]
["1","Zona 1","Zona 4","14","Interrumpible",12.203239999999999]
["1","Zona 1","Zona 5","15","Interrumpible",18.747]
["1","Zona 1","Zona 6","16","Interrumpible",22.120830000000002]
["1","Zona 1","Zona 7","17","Interrumpible","Sin tarifa"]
["1","Zona 1","Zona 8","18","Interrumpible","Sin tarifa"]
["1","Zona 1","Zona 9","19","Interrumpible","Sin tarifa"]
["3","Zona 3","Zona 1","31","Firme",8.7890300000000003]
{"$rows_left_out":108}
{"sheet":"Listas","index":5,"n_rows":33,"n_cols":11,"rows_kept":33,"cut":false,"hidden":true,"merged":[]}
[null,"Fecha","Combustible","Unidades","Unidad de tiempo","Regiones inyección","Regiones extracción",null,"Abreviatura_formulada","Abreviatura","Estado"]
[null,"2023-02-01","Combustoleo","Pesos/Litro","Día","Región I","Región I",null,"Gto","Ags","Aguascalientes"]
[null,"2023-03-01","Diésel","Pesos/Kilo","Semana","Región II","Región II",null,null,"B.C.","Baja California"]
[null,"2023-04-01","Gas Lp Kg",null,"Quincena","Región III","Región III",null,null,"B.C.S.","Baja California Sur"]
[null,"2023-05-01","Gas Lp Lt",null,"Mes","Región IV","Región IV",null,null,"Camp","Campeche"]
[null,null,"Magna",null,"Año","Región V","Región V",null,null,"Chis","Chiapas"]
[null,null,"Premium",null,null,"Región VI","Región VI",null,null,"Chih","Chihuahua"]
[null,null,null,null,null,null,null,null,null,"Cdmx","Ciudad de México"]
[null,null,null,null,null,null,null,null,null,"Coah","Coahuila"]
[null,null,null,null,null,null,null,null,null,"Col","Colima"]
[null,null,null,null,null,null,null,null,null,"Dgo","Durango"]
[null,null,null,null,null,null,null,null,null,"Gto","Guanajuato"]
[null,null,null,null,null,null,null,null,null,"Gro","Guerrero"]
[null,null,null,null,null,null,null,null,null,"Hgo","Hidalgo"]
[null,null,null,null,null,null,null,null,null,"Jal","Jalisco"]
[null,null,null,null,null,null,null,null,null,"Mex","Estado de México"]
[null,null,null,null,null,null,null,null,null,"Mich","Michoacán"]
[null,null,null,null,null,null,null,null,null,"Mor","Morelos"]
[null,null,null,null,null,null,null,null,null,"Nay","Nayarit"]
[null,null,null,null,null,null,null,null,null,"N.L.","Nuevo León"]
{"$rows_left_out":14}
{"sheet":"Datos y cálculos","index":6,"n_rows":15,"n_cols":4,"rows_kept":15,"cut":false,"hidden":true,"merged":[]}
["Combustible","GJ","MMBtu","unidad"]
["gas natural",3.1719999999999998E-2,3.0064750000000001E-2,"litros"]
["Diésel",3.6974020000000003E-2,3.9009660000000002E-2,"litros"]
["Gas Lp Kg",4.7443902439024396E-2,5.0055971820740952E-2,"kilos"]
["Gas Lp Lt",2.5555184534844153E-2,2.6962149637543564E-2,"litros"]
["Combustoleo",4.0078669999999997E-2,4.2285240000000002E-2,"litros"]
["Premium",3.6974020000000003E-2,3.3744830000000003E-2,"litros"]
["Magna",3.6974020000000003E-2,3.3744830000000003E-2,"litros"]
["carbon",19.518536000000001,null,"toneladas"]
[]
[]
[]
[]
["Gas Lp Kg",null,null,"kilos"]
["Gas Lp Lt",9.7259999999999999E-2,9.2184680000000005E-2,"litros"]

{"sheet":"Precios_","index":7,"n_rows":1025,"n_cols":7,"rows_kept":1025,"cut":false,"hidden":true,"merged":[]}
["Fecha","Estado","Combustible","Precio","Tipodecambio","Unidad","Región"]
["2023-02-01","Aguascalientes","Magna",21.5857930198726,18.6418,"Lt","Región IV"]
["2023-02-01","Baja California","Magna",21.06894614925514,18.6418,"Lt","Región I"]
["2023-02-01","Baja California Sur","Magna",22.972389994150738,18.6418,"Lt","NA"]
["2023-02-01","Campeche","Magna",23.006643093213679,18.6418,"Lt","Región VI"]
["2023-02-01","Chiapas","Magna",21.852716740592889,18.6418,"Lt","Región VI"]
["2023-02-01","Chihuahua","Magna",19.762440177638819,18.6418,"Lt","Región II"]
["2023-02-01","Ciudad de México","Magna",22.366569906454099,18.6418,"Lt","Región V"]
["2023-02-01","Coahuila","Magna",21.10058106896426,18.6418,"Lt","Región II"]
["2023-02-01","Colima","Magna",22.16154200602309,18.6418,"Lt","Región IV"]
["2023-02-01","Durango","Magna",22.063447375130671,18.6418,"Lt","Región II"]
["2023-02-01","Guanajuato","Magna",22.046908316696911,18.6418,"Lt","Región V"]
["2023-02-01","Guerrero","Magna",23.30381867532034,18.6418,"Lt","Región V"]
["2023-02-01","Hidalgo","Magna",21.363052082768672,18.6418,"Lt","Región V"]
["2023-02-01","Jalisco","Magna",22.392877919212491,18.6418,"Lt","Región IV"]
["2023-02-01","Estado de México","Magna",21.739054709010698,18.6418,"Lt","Región V"]
["2023-02-01","Michoacán","Magna",22.452094241601898,18.6418,"Lt","Región V"]
["2023-02-01","Morelos","Magna",21.54171036002597,18.6418,"Lt","Región V"]
["2023-02-01","Nayarit","Magna",22.653843441925119,18.6418,"Lt","NA"]
["2023-02-01","Nuevo León","Magna",23.16743977780224,18.6418,"Lt","Región III"]
{"$rows_left_out":1006}
{"sheet":"Notas","index":8,"n_rows":23,"n_cols":2,"rows_kept":23,"cut":false,"hidden":false,"merged":[[22,1,22,8],[20,1,20,8],[16,1,16,8],[18,1,18,8],[4,0,4,8],[6,1,6,8],[8,1,8,8],[10,1,10,8],[12,1,12,8],[14,1,14,8]]}
["Centro Nacional de Control del Gas Natural"]
["Unidad de Gestión Técnica y Planeación"]
["Dirección Ejecutiva de Planeación"]
[]
[{"$f":"UPPER(\"Vínculos a las fuentes de información\")","v":"VÍNCULOS A LAS FUENTES DE INFORMACIÓN"}]
[]
["Gas natural","https://www.cre.gob.mx//IPGN/"]
[]
["Combustóleo","https://www.pemex.com/ri/Publicaciones/Paginas/IndicadoresPetroleros.aspx"]
[]
["Diésel","https://www.gob.mx/cre/articulos/precios-vigentes-de-gasolinas-y-diesel"]
[]
["Gas LP","https://www.gob.mx/cre/documentos/historial-de-precios-promedio-al-publico-de-gas-lp-reportados-por-los-distribuidores?state=published"]
[]
["Premium","https://www.gob.mx/cre/articulos/precios-vigentes-de-gasolinas-y-diesel"]
[]
["Magna","https://www.gob.mx/cre/articulos/precios-vigentes-de-gasolinas-y-diesel"]
[]
["Factores de conversión","https://www.gob.mx/cre/documentos/factores-de-conversion-para-gas-natural"]
[]
{"$rows_left_out":3}